Reaction Details
TargetPotassium voltage-gated channel subfamily H member 2
LigandBDBM50140541
Substrate/Competitorn/a
Meas. Tech.ChEBML_65269
Ki>90000±n/a nM
Citation Caldwell, CGChen, PHe, JParmee, ERLeiting, BMarsilio, FPatel, RAWu, JKEiermann, GJPetrov, AHe, HLyons, KAThornberry, NAWeber, AE Fluoropyrrolidine amides as dipeptidyl peptidase IV inhibitors. Bioorg Med Chem Lett14:1265-8 (2004) 
 
Potassium voltage-gated channel subfamily H member 2
Name:Potassium voltage-gated channel subfamily H member 2
Type:Multi-pass membrane protein
Mol. Mass.:126672.65
Organism:Homo sapiens (Human)
Description:Q12809
Residue:1159
BDBM50140541
NameBDBM50140541
Synonyms:(S)-2-Amino-2-cyclohexyl-1-(3,3-difluoro-pyrrolidin-1-yl)-ethanone CHEMBL280658
TypeSmall organic molecule
Emp. Form.C12H20F2N2O
Mol. Mass.246.2968
SMILESN[C@@H](C1CCCCC1)C(=O)N1CCC(F)(F)C1