Reaction Details
TargetDipeptidyl peptidase 4
LigandBDBM50140524
Substrate/Competitorn/a
Meas. Tech.ChEBML_53340
IC50 110±n/a nM
Citation Caldwell, CGChen, PHe, JParmee, ERLeiting, BMarsilio, FPatel, RAWu, JKEiermann, GJPetrov, AHe, HLyons, KAThornberry, NAWeber, AE Fluoropyrrolidine amides as dipeptidyl peptidase IV inhibitors. Bioorg Med Chem Lett14:1265-8 (2004) 
 
Dipeptidyl peptidase 4
Name:Dipeptidyl peptidase 4
Type:Enzyme
Mol. Mass.:88271.01
Organism:Homo sapiens (Human)
Description:P27487
Residue:766
BDBM50140524
NameBDBM50140524
Synonyms:CHEMBL23924 | N-{4-[(S)-1-Amino-2-((R)-3-fluoro-pyrrolidin-1-yl)-2-oxo-ethyl]-cyclohexyl}-3,4-difluoro-benzamide
TypeSmall organic molecule
Emp. Form.C19H24F3N3O2
Mol. Mass.383.408
SMILESN[C@@H]([C@H]1CC[C@@H](CC1)NC(=O)c1ccc(F)c(F)c1)C(=O)N1CC[C@@H](F)C1