Reaction Details
TargetDipeptidyl peptidase 4
LigandBDBM50140540
Substrate/Competitorn/a
Meas. Tech.ChEBML_53340
IC50 270±n/a nM
Citation Caldwell, CGChen, PHe, JParmee, ERLeiting, BMarsilio, FPatel, RAWu, JKEiermann, GJPetrov, AHe, HLyons, KAThornberry, NAWeber, AE Fluoropyrrolidine amides as dipeptidyl peptidase IV inhibitors. Bioorg Med Chem Lett14:1265-8 (2004) 
 
Dipeptidyl peptidase 4
Name:Dipeptidyl peptidase 4
Type:Enzyme
Mol. Mass.:88271.01
Organism:Homo sapiens (Human)
Description:P27487
Residue:766
BDBM50140540
NameBDBM50140540
Synonyms:CHEMBL23051 | N-{4-[(S)-1-Amino-2-((3R,4R)-3,4-difluoro-pyrrolidin-1-yl)-2-oxo-ethyl]-cyclohexyl}-4-trifluoromethoxy-benzenesulfonamide
TypeSmall organic molecule
Emp. Form.C19H24F5N3O4S
Mol. Mass.485.469
SMILESN[C@@H]([C@H]1CC[C@@H](CC1)NS(=O)(=O)c1ccc(OC(F)(F)F)cc1)C(=O)N1C[C@@H](F)[C@H](F)C1