Reaction Details
TargetcGMP-specific 3',5'-cyclic phosphodiesterase
LigandBDBM50140619
Substrate/Competitorn/a
Meas. Tech.ChEBML_155208
IC50 0.900000±n/a nM
Citation Pissarnitski, DAAsberom, TBoyle, CDChackalamannil, SChintala, MClader, JWGreenlee, WJHu, YKurowski, SMyers, JPalamanda, JStamford, AWVemulapalli, SWang, YWang, PWu, PXu, R SAR development of polycyclic guanine derivatives targeted to the discovery of a selective PDE5 inhibitor for treatment of erectile dysfunction. Bioorg Med Chem Lett14:1291-4 (2004) 
 
cGMP-specific 3',5'-cyclic phosphodiesterase
Name:cGMP-specific 3',5'-cyclic phosphodiesterase
Type:Protein
Mol. Mass.:99975.83
Organism:Homo sapiens (Human)
Description:O76074
Residue:875
BDBM50140619
NameBDBM50140619
Synonyms:2-ethoxy-5-ethyl-3-(4-hydroxybenzyl)-(6aR,9aS)-3,4,5,8-tetrahydrocyclopenta[4,5]imidazo[2,1-b]purin-4-one | CHEMBL280525
TypeSmall organic molecule
Emp. Form.C21H25N5O3
Mol. Mass.395.4549
SMILESCCOc1nc2N3[C@H]4CCC[C@H]4N=C3N(CC)C(=O)c2n1Cc1ccc(O)cc1