Reaction Details
TargetcGMP-specific 3',5'-cyclic phosphodiesterase
LigandBDBM50140583
Substrate/Competitorn/a
Meas. Tech.ChEBML_155208
IC50 0.300000±n/a nM
Citation Pissarnitski, DAAsberom, TBoyle, CDChackalamannil, SChintala, MClader, JWGreenlee, WJHu, YKurowski, SMyers, JPalamanda, JStamford, AWVemulapalli, SWang, YWang, PWu, PXu, R SAR development of polycyclic guanine derivatives targeted to the discovery of a selective PDE5 inhibitor for treatment of erectile dysfunction. Bioorg Med Chem Lett14:1291-4 (2004) 
 
cGMP-specific 3',5'-cyclic phosphodiesterase
Name:cGMP-specific 3',5'-cyclic phosphodiesterase
Type:Protein
Mol. Mass.:99975.83
Organism:Homo sapiens (Human)
Description:O76074
Residue:875
BDBM50140583
NameBDBM50140583
Synonyms:5-ethyl-3-(4-hydroxybenzyl)-2-(2-phenyl-1-ethynyl)-(6aR,9aS)-3,4,5,8-tetrahydrocyclopenta[4,5]imidazo[2,1-b]purin-4-one | CHEMBL26396
TypeSmall organic molecule
Emp. Form.C27H25N5O2
Mol. Mass.451.5197
SMILESCCN1C2=N[C@@H]3CCC[C@@H]3N2c2nc(C#Cc3ccccc3)n(Cc3ccc(O)cc3)c2C1=O