Reaction Details
TargetC-X-C chemokine receptor type 1
LigandBDBM50140791
Substrate/Competitorn/a
Meas. Tech.ChEMBL_44673 (CHEMBL656546)
IC50 2600±n/a nM
Citation Widdowson, KLElliott, JDVeber, DFNie, HRutledge, MCMcCleland, BWXiang, JNJurewicz, AJHertzberg, RPFoley, JJGriswold, DEMartin, LLee, JMWhite, JRSarau, HM Evaluation of potent and selective small-molecule antagonists for the CXCR2 chemokine receptor. J Med Chem47:1319-21 (2004) 
 
C-X-C chemokine receptor type 1
Name:C-X-C chemokine receptor type 1
Type:Enzyme
Mol. Mass.:39803.83
Organism:Homo sapiens (Human)
Description:P25024
Residue:350
BDBM50140791
NameBDBM50140791
Synonyms:1-(3-Bromo-4-cyano-2-hydroxy-phenyl)-3-(2-bromo-phenyl)-urea | CHEMBL28009
TypeSmall organic molecule
Emp. Form.C14H9Br2N3O2
Mol. Mass.411.048
SMILESOc1c(NC(=O)Nc2ccccc2Br)ccc(C#N)c1Br