Reaction Details
TargetC-X-C chemokine receptor type 1
LigandBDBM50140796
Substrate/Competitorn/a
Meas. Tech.ChEMBL_44673 (CHEMBL656546)
IC50 15100±n/a nM
Citation Widdowson, KLElliott, JDVeber, DFNie, HRutledge, MCMcCleland, BWXiang, JNJurewicz, AJHertzberg, RPFoley, JJGriswold, DEMartin, LLee, JMWhite, JRSarau, HM Evaluation of potent and selective small-molecule antagonists for the CXCR2 chemokine receptor. J Med Chem47:1319-21 (2004) 
 
C-X-C chemokine receptor type 1
Name:C-X-C chemokine receptor type 1
Type:Enzyme
Mol. Mass.:39803.83
Organism:Homo sapiens (Human)
Description:P25024
Residue:350
BDBM50140796
NameBDBM50140796
Synonyms:1-(2-Bromo-phenyl)-3-(4-cyano-2-hydroxy-phenyl)-urea CHEMBL27863
TypeSmall organic molecule
Emp. Form.C14H10BrN3O2
Mol. Mass.332.152
SMILESOc1cc(ccc1NC(=O)Nc1ccccc1Br)C#N