Reaction Details
TargetC-X-C chemokine receptor type 1
LigandBDBM50140793
Substrate/Competitorn/a
Meas. Tech.ChEMBL_44673 (CHEMBL656546)
IC50 33200.0±n/a nM
Citation Widdowson, KLElliott, JDVeber, DFNie, HRutledge, MCMcCleland, BWXiang, JNJurewicz, AJHertzberg, RPFoley, JJGriswold, DEMartin, LLee, JMWhite, JRSarau, HM Evaluation of potent and selective small-molecule antagonists for the CXCR2 chemokine receptor. J Med Chem47:1319-21 (2004) 
 
C-X-C chemokine receptor type 1
Name:C-X-C chemokine receptor type 1
Type:Enzyme
Mol. Mass.:39803.83
Organism:Homo sapiens (Human)
Description:P25024
Residue:350
BDBM50140793
NameBDBM50140793
Synonyms:1-(2-Hydroxy-3-nitro-phenyl)-3-phenyl-urea | CHEMBL283736
TypeSmall organic molecule
Emp. Form.C13H11N3O4
Mol. Mass.273.2441
SMILESOc1c(NC(=O)Nc2ccccc2)cccc1[N+]([O-])=O