Reaction Details
TargetC-X-C chemokine receptor type 2
LigandBDBM50140790
Substrate/Competitorn/a
Meas. Tech.ChEMBL_44678 (CHEMBL656551)
IC50 10900±n/a nM
Citation Widdowson, KLElliott, JDVeber, DFNie, HRutledge, MCMcCleland, BWXiang, JNJurewicz, AJHertzberg, RPFoley, JJGriswold, DEMartin, LLee, JMWhite, JRSarau, HM Evaluation of potent and selective small-molecule antagonists for the CXCR2 chemokine receptor. J Med Chem47:1319-21 (2004) 
 
C-X-C chemokine receptor type 2
Name:C-X-C chemokine receptor type 2
Type:Protein
Mol. Mass.:40767.88
Organism:Homo sapiens (Human)
Description:P25025
Residue:360
BDBM50140790
NameBDBM50140790
Synonyms:1-(2-Hydroxy-5-nitro-phenyl)-3-phenyl-urea | CHEMBL24912
TypeSmall organic molecule
Emp. Form.C13H11N3O4
Mol. Mass.273.2441
SMILESOc1ccc(cc1NC(=O)Nc1ccccc1)[N+]([O-])=O