Reaction Details
TargetATP-dependent translocase ABCB1
LigandBDBM50140798
Substrate/Competitorn/a
Meas. Tech.ChEMBL_147986 (CHEMBL754111)
IC50 4790±n/a nM
Citation Wang, SFolkes, AChuckowree, ICockcroft, XSohal, SMiller, WMilton, JWren, SPVicker, NDepledge, PScott, JSmith, LJones, HMistry, PFaint, RThompson, DCocks, S Studies on pyrrolopyrimidines as selective inhibitors of multidrug-resistance-associated protein in multidrug resistance. J Med Chem47:1329-38 (2004) 
 
ATP-dependent translocase ABCB1
Name:ATP-dependent translocase ABCB1
Type:PROTEIN
Mol. Mass.:141009.67
Organism:Mus musculus
Description:ChEMBL_474396
Residue:1276
BDBM50140798
NameBDBM50140798
Synonyms:4-{4-[2-(3,4-Difluoro-phenyl)-ethyl]-piperazin-1-yl}-6,7,8,9-tetrahydro-pyrimido[4,5-b]indolizine-10-carboxylic acid ethylamide | CHEMBL286272
TypeSmall organic molecule
Emp. Form.C25H30F2N6O
Mol. Mass.468.5421
SMILESCCNC(=O)c1c2CCCCn2c2c(ncnc12)N1CCN(CCc2ccc(F)c(F)c2)CC1