Reaction Details
TargetATP-dependent translocase ABCB1
LigandBDBM50140829
Substrate/Competitorn/a
Meas. Tech.ChEMBL_147986 (CHEMBL754111)
IC50 9630.0±n/a nM
Citation Wang, SFolkes, AChuckowree, ICockcroft, XSohal, SMiller, WMilton, JWren, SPVicker, NDepledge, PScott, JSmith, LJones, HMistry, PFaint, RThompson, DCocks, S Studies on pyrrolopyrimidines as selective inhibitors of multidrug-resistance-associated protein in multidrug resistance. J Med Chem47:1329-38 (2004) 
 
ATP-dependent translocase ABCB1
Name:ATP-dependent translocase ABCB1
Type:PROTEIN
Mol. Mass.:141009.67
Organism:Mus musculus
Description:ChEMBL_474396
Residue:1276
BDBM50140829
NameBDBM50140829
Synonyms:4-(4-Phenethyl-piperazin-1-yl)-6,7,8,9-tetrahydro-pyrimido[4,5-b]indolizine-10-carbonitrile | CHEMBL28098
TypeSmall organic molecule
Emp. Form.C23H26N6
Mol. Mass.386.4927
SMILESN#Cc1c2CCCCn2c2c(ncnc12)N1CCN(CCc2ccccc2)CC1