Reaction Details
TargetATP-dependent translocase ABCB1
LigandBDBM50140820
Substrate/Competitorn/a
Meas. Tech.ChEMBL_147986 (CHEMBL754111)
IC50 3700±n/a nM
Citation Wang, SFolkes, AChuckowree, ICockcroft, XSohal, SMiller, WMilton, JWren, SPVicker, NDepledge, PScott, JSmith, LJones, HMistry, PFaint, RThompson, DCocks, S Studies on pyrrolopyrimidines as selective inhibitors of multidrug-resistance-associated protein in multidrug resistance. J Med Chem47:1329-38 (2004) 
 
ATP-dependent translocase ABCB1
Name:ATP-dependent translocase ABCB1
Type:PROTEIN
Mol. Mass.:141009.67
Organism:Mus musculus
Description:ChEMBL_474396
Residue:1276
BDBM50140820
NameBDBM50140820
Synonyms:4-{4-[2-(3,4-Difluoro-phenyl)-ethyl]-piperazin-1-yl}-6,7,8,9-tetrahydro-pyrimido[4,5-b]indolizine-10-carboxylic acid 2,3-dimethoxy-benzylamide | CHEMBL27102
TypeSmall organic molecule
Emp. Form.C32H36F2N6O3
Mol. Mass.590.6634
SMILESCOc1cccc(CNC(=O)c2c3CCCCn3c3c(ncnc23)N2CCN(CCc3ccc(F)c(F)c3)CC2)c1OC