Reaction Details
TargetATP-dependent translocase ABCB1
LigandBDBM50140863
Substrate/Competitorn/a
Meas. Tech.ChEMBL_148009 (CHEMBL751606)
IC50 1480±n/a nM
Citation Wang, SWan, NCHarrison, JMiller, WChuckowree, ISohal, SHancox, TCBaker, SFolkes, AWilson, FThompson, DCocks, SFarmer, HBoyce, AFreathy, CBroadbridge, JScott, JDepledge, PFaint, RMistry, PCharlton, P Design and synthesis of new templates derived from pyrrolopyrimidine as selective multidrug-resistance-associated protein inhibitors in multidrug resistance. J Med Chem47:1339-50 (2004) 
 
ATP-dependent translocase ABCB1
Name:ATP-dependent translocase ABCB1
Type:Protein
Mol. Mass.:140669.02
Organism:Mus musculus (Mouse)
Description:P21447
Residue:1276
BDBM50140863
NameBDBM50140863
Synonyms:4-{4-[2-(3,4-Difluoro-phenyl)-ethyl]-piperazin-1-yl}-2-morpholin-4-ylmethyl-6,8-dinitro-5H-pyrimido[5,4-b]indole | CHEMBL284024
TypeSmall organic molecule
Emp. Form.C27H28F2N8O5
Mol. Mass.582.5586
SMILES[O-][N+](=O)c1cc([N+]([O-])=O)c2[nH]c3c(nc(CN4CCOCC4)nc3c2c1)N1CCN(CCc2ccc(F)c(F)c2)CC1