Reaction Details
TargetATP-dependent translocase ABCB1
LigandBDBM50140838
Substrate/Competitorn/a
Meas. Tech.ChEMBL_148009 (CHEMBL751606)
IC50>1000±n/a nM
Citation Wang, SWan, NCHarrison, JMiller, WChuckowree, ISohal, SHancox, TCBaker, SFolkes, AWilson, FThompson, DCocks, SFarmer, HBoyce, AFreathy, CBroadbridge, JScott, JDepledge, PFaint, RMistry, PCharlton, P Design and synthesis of new templates derived from pyrrolopyrimidine as selective multidrug-resistance-associated protein inhibitors in multidrug resistance. J Med Chem47:1339-50 (2004) 
 
ATP-dependent translocase ABCB1
Name:ATP-dependent translocase ABCB1
Type:Protein
Mol. Mass.:140669.02
Organism:Mus musculus (Mouse)
Description:P21447
Residue:1276
BDBM50140838
NameBDBM50140838
Synonyms:9-Chloro-4-{4-[2-(3,4-difluoro-phenyl)-ethyl]-piperazin-1-yl}-5H-pyrimido[5,4-b]indole | CHEMBL28584
TypeSmall organic molecule
Emp. Form.C22H20ClF2N5
Mol. Mass.427.878
SMILESFc1ccc(CCN2CCN(CC2)c2ncnc3c2[nH]c2cccc(Cl)c32)cc1F