Reaction Details
TargetATP-dependent translocase ABCB1
LigandBDBM50140841
Substrate/Competitorn/a
Meas. Tech.ChEMBL_148009 (CHEMBL751606)
IC50 7560±n/a nM
Citation Wang, SWan, NCHarrison, JMiller, WChuckowree, ISohal, SHancox, TCBaker, SFolkes, AWilson, FThompson, DCocks, SFarmer, HBoyce, AFreathy, CBroadbridge, JScott, JDepledge, PFaint, RMistry, PCharlton, P Design and synthesis of new templates derived from pyrrolopyrimidine as selective multidrug-resistance-associated protein inhibitors in multidrug resistance. J Med Chem47:1339-50 (2004) 
 
ATP-dependent translocase ABCB1
Name:ATP-dependent translocase ABCB1
Type:Protein
Mol. Mass.:140669.02
Organism:Mus musculus (Mouse)
Description:P21447
Residue:1276
BDBM50140841
NameBDBM50140841
Synonyms:1-{4-[2-(3,4-Difluoro-phenyl)-ethyl]-piperazin-1-yl}-9-methyl-9H-2,4,5,9-tetraaza-fluorene | CHEMBL282365
TypeSmall organic molecule
Emp. Form.C22H22F2N6
Mol. Mass.408.4471
SMILESCn1c2cccnc2c2ncnc(N3CCN(CCc4ccc(F)c(F)c4)CC3)c12