Reaction Details
TargetATP-dependent translocase ABCB1
LigandBDBM50140836
Substrate/Competitorn/a
Meas. Tech.ChEMBL_148009 (CHEMBL751606)
IC50>1000±n/a nM
Citation Wang, SWan, NCHarrison, JMiller, WChuckowree, ISohal, SHancox, TCBaker, SFolkes, AWilson, FThompson, DCocks, SFarmer, HBoyce, AFreathy, CBroadbridge, JScott, JDepledge, PFaint, RMistry, PCharlton, P Design and synthesis of new templates derived from pyrrolopyrimidine as selective multidrug-resistance-associated protein inhibitors in multidrug resistance. J Med Chem47:1339-50 (2004) 
 
ATP-dependent translocase ABCB1
Name:ATP-dependent translocase ABCB1
Type:Protein
Mol. Mass.:140669.02
Organism:Mus musculus (Mouse)
Description:P21447
Residue:1276
BDBM50140836
NameBDBM50140836
Synonyms:4-{4-[2-(3,4-Difluoro-phenyl)-ethyl]-piperazin-1-yl}-8-methoxy-9-nitro-5H-pyrimido[5,4-b]indole | CHEMBL27191
TypeSmall organic molecule
Emp. Form.C23H22F2N6O3
Mol. Mass.468.456
SMILESCOc1ccc2[nH]c3c(ncnc3c2c1[N+]([O-])=O)N1CCN(CCc2ccc(F)c(F)c2)CC1