Reaction Details
TargetATP-dependent translocase ABCB1
LigandBDBM50140861
Substrate/Competitorn/a
Meas. Tech.ChEMBL_148009 (CHEMBL751606)
IC50 1738±n/a nM
Citation Wang, SWan, NCHarrison, JMiller, WChuckowree, ISohal, SHancox, TCBaker, SFolkes, AWilson, FThompson, DCocks, SFarmer, HBoyce, AFreathy, CBroadbridge, JScott, JDepledge, PFaint, RMistry, PCharlton, P Design and synthesis of new templates derived from pyrrolopyrimidine as selective multidrug-resistance-associated protein inhibitors in multidrug resistance. J Med Chem47:1339-50 (2004) 
 
ATP-dependent translocase ABCB1
Name:ATP-dependent translocase ABCB1
Type:Protein
Mol. Mass.:140669.02
Organism:Mus musculus (Mouse)
Description:P21447
Residue:1276
BDBM50140861
NameBDBM50140861
Synonyms:4-{4-[2-(3,4-Difluoro-phenyl)-ethyl]-piperazin-1-yl}-8-nitro-5H-pyrimido[5,4-b]indole | CHEMBL25867
TypeSmall organic molecule
Emp. Form.C22H20F2N6O2
Mol. Mass.438.43
SMILES[O-][N+](=O)c1ccc2[nH]c3c(ncnc3c2c1)N1CCN(CCc2ccc(F)c(F)c2)CC1