Reaction Details
TargetATP-dependent translocase ABCB1
LigandBDBM50140853
Substrate/Competitorn/a
Meas. Tech.ChEMBL_148009 (CHEMBL751606)
IC50 1900±n/a nM
Citation Wang, SWan, NCHarrison, JMiller, WChuckowree, ISohal, SHancox, TCBaker, SFolkes, AWilson, FThompson, DCocks, SFarmer, HBoyce, AFreathy, CBroadbridge, JScott, JDepledge, PFaint, RMistry, PCharlton, P Design and synthesis of new templates derived from pyrrolopyrimidine as selective multidrug-resistance-associated protein inhibitors in multidrug resistance. J Med Chem47:1339-50 (2004) 
 
ATP-dependent translocase ABCB1
Name:ATP-dependent translocase ABCB1
Type:Protein
Mol. Mass.:140669.02
Organism:Mus musculus (Mouse)
Description:P21447
Residue:1276
BDBM50140853
NameBDBM50140853
Synonyms:(4-{4-[2-(3,4-Difluoro-phenyl)-ethyl]-piperazin-1-yl}-5-methyl-5H-pyrido[3',4':4,5]pyrrolo[3,2-d]pyrimidin-9-yl)-methyl-amine | CHEMBL25731
TypeSmall organic molecule
Emp. Form.C23H25F2N7
Mol. Mass.437.4883
SMILESCNc1nccc2n(C)c3c(ncnc3c12)N1CCN(CCc2ccc(F)c(F)c2)CC1