Reaction Details
TargetATP-dependent translocase ABCB1
LigandBDBM50140845
Substrate/Competitorn/a
Meas. Tech.ChEMBL_148007 (CHEMBL754165)
IC50 6940±n/a nM
Citation Wang, SWan, NCHarrison, JMiller, WChuckowree, ISohal, SHancox, TCBaker, SFolkes, AWilson, FThompson, DCocks, SFarmer, HBoyce, AFreathy, CBroadbridge, JScott, JDepledge, PFaint, RMistry, PCharlton, P Design and synthesis of new templates derived from pyrrolopyrimidine as selective multidrug-resistance-associated protein inhibitors in multidrug resistance. J Med Chem47:1339-50 (2004) 
 
ATP-dependent translocase ABCB1
Name:ATP-dependent translocase ABCB1
Type:Protein
Mol. Mass.:140669.02
Organism:Mus musculus (Mouse)
Description:P21447
Residue:1276
BDBM50140845
NameBDBM50140845
Synonyms:4-{4-[2-(3,4-Difluoro-phenyl)-ethyl]-piperazin-1-yl}-9-nitro-5-phenethyl-5H-pyrimido[5,4-b]indole | CHEMBL285343
TypeSmall organic molecule
Emp. Form.C30H28F2N6O2
Mol. Mass.542.5791
SMILES[O-][N+](=O)c1cccc2n(CCc3ccccc3)c3c(ncnc3c12)N1CCN(CCc2ccc(F)c(F)c2)CC1