Reaction Details
TargetATP-dependent translocase ABCB1
LigandBDBM50140875
Substrate/Competitorn/a
Meas. Tech.ChEMBL_148009 (CHEMBL751606)
IC50 1200±n/a nM
Citation Wang, SWan, NCHarrison, JMiller, WChuckowree, ISohal, SHancox, TCBaker, SFolkes, AWilson, FThompson, DCocks, SFarmer, HBoyce, AFreathy, CBroadbridge, JScott, JDepledge, PFaint, RMistry, PCharlton, P Design and synthesis of new templates derived from pyrrolopyrimidine as selective multidrug-resistance-associated protein inhibitors in multidrug resistance. J Med Chem47:1339-50 (2004) 
 
ATP-dependent translocase ABCB1
Name:ATP-dependent translocase ABCB1
Type:Protein
Mol. Mass.:140669.02
Organism:Mus musculus (Mouse)
Description:P21447
Residue:1276
BDBM50140875
NameBDBM50140875
Synonyms:4-{4-[2-(3,4-Difluoro-phenyl)-ethyl]-piperazin-1-yl}-5-methyl-5H-pyrimido[5,4-b]indole-9-carboxylic acid amide | CHEMBL26678
TypeSmall organic molecule
Emp. Form.C24H24F2N6O
Mol. Mass.450.4838
SMILESCn1c2cccc(C(N)=O)c2c2ncnc(N3CCN(CCc4ccc(F)c(F)c4)CC3)c12