Reaction Details
TargetATP-dependent translocase ABCB1
LigandBDBM50140859
Substrate/Competitorn/a
Meas. Tech.ChEMBL_148009 (CHEMBL751606)
IC50 1220±n/a nM
Citation Wang, SWan, NCHarrison, JMiller, WChuckowree, ISohal, SHancox, TCBaker, SFolkes, AWilson, FThompson, DCocks, SFarmer, HBoyce, AFreathy, CBroadbridge, JScott, JDepledge, PFaint, RMistry, PCharlton, P Design and synthesis of new templates derived from pyrrolopyrimidine as selective multidrug-resistance-associated protein inhibitors in multidrug resistance. J Med Chem47:1339-50 (2004) 
 
ATP-dependent translocase ABCB1
Name:ATP-dependent translocase ABCB1
Type:Protein
Mol. Mass.:140669.02
Organism:Mus musculus (Mouse)
Description:P21447
Residue:1276
BDBM50140859
NameBDBM50140859
Synonyms:9-Chloro-4-{4-[2-(3,4-difluoro-phenyl)-ethyl]-piperazin-1-yl}-5-methyl-5H-pyrido[3',4':4,5]pyrrolo[3,2-d]pyrimidine | CHEMBL27415
TypeSmall organic molecule
Emp. Form.C22H21ClF2N6
Mol. Mass.442.892
SMILESCn1c2ccnc(Cl)c2c2ncnc(N3CCN(CCc4ccc(F)c(F)c4)CC3)c12