Reaction Details
TargetATP-dependent translocase ABCB1
LigandBDBM50140860
Substrate/Competitorn/a
Meas. Tech.ChEMBL_148007 (CHEMBL754165)
IC50 3310±n/a nM
Citation Wang, SWan, NCHarrison, JMiller, WChuckowree, ISohal, SHancox, TCBaker, SFolkes, AWilson, FThompson, DCocks, SFarmer, HBoyce, AFreathy, CBroadbridge, JScott, JDepledge, PFaint, RMistry, PCharlton, P Design and synthesis of new templates derived from pyrrolopyrimidine as selective multidrug-resistance-associated protein inhibitors in multidrug resistance. J Med Chem47:1339-50 (2004) 
 
ATP-dependent translocase ABCB1
Name:ATP-dependent translocase ABCB1
Type:Protein
Mol. Mass.:140669.02
Organism:Mus musculus (Mouse)
Description:P21447
Residue:1276
BDBM50140860
NameBDBM50140860
Synonyms:4-{4-[2-(3,4-Difluoro-phenyl)-ethyl]-piperazin-1-yl}-8-(pyrrolidine-1-sulfonyl)-5H-pyrimido[5,4-b]indole | CHEMBL27128
TypeSmall organic molecule
Emp. Form.C26H28F2N6O2S
Mol. Mass.526.601
SMILESFc1ccc(CCN2CCN(CC2)c2ncnc3c4cc(ccc4[nH]c23)S(=O)(=O)N2CCCC2)cc1F