Reaction Details
TargetBcl-2-like protein 1
LigandBDBM31374
Substrate/Competitorn/a
Meas. Tech.ChEBML_38726
Ki 839.0±n/a nM
Citation Yin, HHamilton, AD Terephthalamide derivatives as mimetics of the helical region of Bak peptide target Bcl-xL protein. Bioorg Med Chem Lett14:1375-9 (2004) 
 
Bcl-2-like protein 1
Name:Bcl-2-like protein 1
Type:Mitochondrion membrane; Single-pass membrane protein
Mol. Mass.:26039.60
Organism:Homo sapiens (Human)
Description:n/a
Residue:233
BDBM31374
NameBDBM31374
Synonyms:CHEMBL286715 | terephthalamide scaffold, 10
TypeSmall organic molecule
Emp. Form.C23H36N2O5
Mol. Mass.420.5423
SMILESCC(C)C[C@H](NC(=O)c1ccc(cc1OC(C)C)C(=O)N(C(C)C)C(C)C)C(O)=O