Reaction Details
TargetEstrogen receptor beta
LigandBDBM23451
Substrate/Competitorn/a
Meas. Tech.ChEBML_67681
IC50 2±n/a nM
Citation Chen, HYDykstra, KDBirzin, ETFrisch, KChan, WYang, YTMosley, RTDiNinno, FRohrer, SPSchaeffer, JMHammond, ML Estrogen receptor ligands. Part 1: The discovery of flavanoids with subtype selectivity. Bioorg Med Chem Lett14:1417-21 (2004) 
 
Estrogen receptor beta
Name:Estrogen receptor beta
Type:Protein
Mol. Mass.:59238.43
Organism:Homo sapiens (Human)
Description:Q92731
Residue:530
BDBM23451
NameBDBM23451
Synonyms:5,14-dihydroxy-8,17-dioxatetracyclo[8.7.0.0^{2,7}.0^{11,16}]heptadeca-1(10),2,4,6,11(16),12,14-heptaen-9-one CHEMBL30707 Coumestrol US8552057, 3
TypeCoumestan
Emp. Form.C15H8O5
Mol. Mass.268.221
SMILESOc1ccc2c(c1)oc1c2c(=O)oc2cc(O)ccc12