Reaction Details
TargetGenome polyprotein
LigandBDBM50141211
Substrate/Competitorn/a
Meas. Tech.ChEBML_143639
Ki 2700±n/a nM
Citation Perni, RBPitlik, JBritt, SDCourt, JJCourtney, LFDeininger, DDFarmer, LJGates, CAHarbeson, SLLevin, RBLin, CLin, KMoon, YCLuong, YPO'Malley, ETRao, BGThomson, JATung, RDVan Drie, JHWei, Y Inhibitors of hepatitis C virus NS3.4A protease 2. Warhead SAR and optimization. Bioorg Med Chem Lett14:1441-6 (2004) 
 
Genome polyprotein
Name:Genome polyprotein
Type:Protein
Mol. Mass.:67067.41
Organism:Hepatitis C virus
Description:A3EZI9
Residue:631
BDBM50141211
NameBDBM50141211
Synonyms:CHEMBL287455 | Pyrazine-2-carboxylic acid ((R)-1-{(R)-1-[(S)-4-benzyloxy-2-((R)-(S)-1-ethyl-4-methyl-2,3-dioxo-pentylcarbamoyl)-pyrrolidine-1-carbonyl]-2-methyl-propylcarbamoyl}-2-methyl-propyl)-amide
TypeSmall organic molecule
Emp. Form.C35H48N6O7
Mol. Mass.664.7916
SMILESCC[C@H](NC(=O)[C@@H]1C[C@H](CN1C(=O)[C@H](NC(=O)[C@H](NC(=O)c1cnccn1)C(C)C)C(C)C)OCc1ccccc1)C(=O)C(=O)C(C)C