Reaction Details
TargetGenome polyprotein
LigandBDBM50141212
Substrate/Competitorn/a
Meas. Tech.ChEBML_143639
Ki 540±n/a nM
Citation Perni, RBPitlik, JBritt, SDCourt, JJCourtney, LFDeininger, DDFarmer, LJGates, CAHarbeson, SLLevin, RBLin, CLin, KMoon, YCLuong, YPO'Malley, ETRao, BGThomson, JATung, RDVan Drie, JHWei, Y Inhibitors of hepatitis C virus NS3.4A protease 2. Warhead SAR and optimization. Bioorg Med Chem Lett14:1441-6 (2004) 
 
Genome polyprotein
Name:Genome polyprotein
Type:Protein
Mol. Mass.:67067.41
Organism:Hepatitis C virus
Description:A3EZI9
Residue:631
BDBM50141212
NameBDBM50141212
Synonyms:3,4-Dihydro-1H-isoquinoline-2-carboxylic acid (S)-5-[(R)-1-(1-carboxy-2-hydroxy-ethylaminooxalyl)-butylcarbamoyl]-1-((R)-3-methyl-2-{(R)-3-methyl-2-[(pyrazine-2-carbonyl)-amino]-butyrylamino}-butyryl)-pyrrolidin-3-yl ester | CHEMBL285780
TypeSmall organic molecule
Emp. Form.C39H52N8O11
Mol. Mass.808.8772
SMILESCCCC(NC(=O)[C@@H]1C[C@H](CN1C(=O)[C@H](NC(=O)[C@H](NC(=O)c1cnccn1)C(C)C)C(C)C)OC(=O)N1CCc2ccccc2C1)C(=O)C(=O)NC(CO)C(O)=O