Reaction Details
Target1-acyl-sn-glycerol-3-phosphate acyltransferase beta
LigandBDBM50141255
Substrate/Competitorn/a
Meas. Tech.ChEBML_100169
IC50 15±n/a nM
Citation Gong, BHong, FKohm, CBonham, LKlein, P Synthesis and SAR of 2-arylbenzoxazoles, benzothiazoles and benzimidazoles as inhibitors of lysophosphatidic acid acyltransferase-beta. Bioorg Med Chem Lett14:1455-9 (2004) 
 
1-acyl-sn-glycerol-3-phosphate acyltransferase beta
Name:1-acyl-sn-glycerol-3-phosphate acyltransferase beta
Type:PROTEIN
Mol. Mass.:30924.09
Organism:Homo sapiens (Human)
Description:ChEMBL_321473
Residue:278
BDBM50141255
NameBDBM50141255
Synonyms:CHEMBL35508 | [3-(5-Chloro-benzothiazol-2-yl)-4-methyl-phenyl]-carbamic acid prop-2-ynyl ester
TypeSmall organic molecule
Emp. Form.C18H13ClN2O2S
Mol. Mass.356.826
SMILESCc1ccc(NC(=O)OCC#C)cc1-c1nc2cc(Cl)ccc2s1