Reaction Details
Target1-acyl-sn-glycerol-3-phosphate acyltransferase beta
LigandBDBM50141308
Substrate/Competitorn/a
Meas. Tech.ChEBML_100169
IC50 100±n/a nM
Citation Gong, BHong, FKohm, CBonham, LKlein, P Synthesis and SAR of 2-arylbenzoxazoles, benzothiazoles and benzimidazoles as inhibitors of lysophosphatidic acid acyltransferase-beta. Bioorg Med Chem Lett14:1455-9 (2004) 
 
1-acyl-sn-glycerol-3-phosphate acyltransferase beta
Name:1-acyl-sn-glycerol-3-phosphate acyltransferase beta
Type:PROTEIN
Mol. Mass.:30924.09
Organism:Homo sapiens (Human)
Description:ChEMBL_321473
Residue:278
BDBM50141308
NameBDBM50141308
Synonyms:CHEMBL418404 | Pent-4-ynoic acid [4-chloro-3-(5-chloro-benzooxazol-2-yl)-phenyl]-amide
TypeSmall organic molecule
Emp. Form.C18H12Cl2N2O2
Mol. Mass.359.206
SMILESClc1ccc2oc(nc2c1)-c1cc(NC(=O)CCC#C)ccc1Cl