Reaction Details
TargetIntegrin alpha-V/beta-1
LigandBDBM50141334
Substrate/Competitorn/a
Meas. Tech.ChEMBL_32649 (CHEMBL642144)
IC50 0.470000±n/a nM
Citation Penning, TDRussell, MAChen, BBChen, HYDesai, BNDocter, SHEdwards, DJGesicki, GJLiang, CDMalecha, JWYu, SSEngleman, VWFreeman, SKHanneke, MLShannon, KEWestlin, MMNickols, GA Synthesis of cinnamic acids and related isosteres as potent and selective alpha v beta 3 receptor antagonists. Bioorg Med Chem Lett14:1471-6 (2004) 
 
Integrin alpha-V/beta-1
Name:Integrin alpha-V/beta-1
Type:Enzyme
Mol. Mass.:n/a
Description:n/a
Components:This complex has 2 components.
Component 1
Name:Integrin alpha-V
Synonyms:ITAV_HUMAN Integrin alpha-V/alpha-5 VNRA Vitronectin receptor | Vitronectin receptor subunit alpha
Type:PROTEIN
Mol. Mass.:116024.92
Organism:Homo sapiens (Human)
Description:ChEMBL_582336
Residue:1048
Component 2
Name:Integrin beta-1
Synonyms:CD_antigen=CD29 Fibronectin receptor beta GPIIA ITGB1 MDF2 | MSK12
Type:Enzyme
Mol. Mass.:88400.38
Organism:Homo sapiens (Human)
Description:P05556
Residue:798
BDBM50141334
NameBDBM50141334
Synonyms:3-[4-(3-Guanidino-benzoylamino)-phenyl]-2-isopropoxycarbonylamino-propionic acid | CHEMBL431496
TypeSmall organic molecule
Emp. Form.C21H25N5O5
Mol. Mass.427.4537
SMILES[#6]-[#6](-[#6])-[#8]-[#6](=O)-[#7]-[#6](-[#6]-c1ccc(-[#7]-[#6](=O)-c2cccc(c2)\[#7]=[#6](/[#7])-[#7])cc1)-[#6](-[#8])=O