Reaction Details
TargetPeptide deformylase
LigandBDBM50141360
Substrate/Competitorn/a
Meas. Tech.ChEBML_144950
IC50 12±n/a nM
Citation Molteni, VHe, XNabakka, JYang, KKreusch, AGordon, PBursulaya, BWarner, IShin, TBiorac, TRyder, NSGoldberg, RDoughty, JHe, Y Identification of novel potent bicyclic peptide deformylase inhibitors. Bioorg Med Chem Lett14:1477-81 (2004) 
 
Peptide deformylase
Name:Peptide deformylase
Type:PROTEIN
Mol. Mass.:20556.80
Organism:Staphylococcus aureus (strain Mu50 / ATCC 700699)
Description:ChEMBL_459563
Residue:183
BDBM50141360
NameBDBM50141360
Synonyms:2-(4-Benzyl-3-oxo-3,4-dihydro-2H-benzo[1,4]thiazin-2-yl)-N-hydroxy-acetamide | CHEMBL285547
TypeSmall organic molecule
Emp. Form.C17H16N2O3S
Mol. Mass.328.386
SMILESONC(=O)CC1Sc2ccccc2N(Cc2ccccc2)C1=O