Reaction Details
TargetEndothelin receptor type B
LigandBDBM50141472
Substrate/Competitorn/a
Meas. Tech.ChEBML_63695
IC50 25±n/a nM
Citation Takahashi, HOhtake, NSakamoto, TIino, TKawanishi, NNakamura, MYoshizumi, TNiiyama, KOzaki, SOkada, HKano, ATakahashi, HIshii, YOkada, MSaito, MSawazaki, YHayama, TNishikibe, M Structure-activity relationships of a novel class of endothelin receptor selective antagonists; 6-carboxy-2-isopropylamino-5,7-diarylcyclopenteno[1,2-b]pyridines. Bioorg Med Chem Lett14:1503-7 (2004) 
 
Endothelin receptor type B
Name:Endothelin receptor type B
Type:Enzyme Catalytic Domain
Mol. Mass.:49664.00
Organism:Homo sapiens (Human)
Description:ENDOTHELIN B EDNRB HUMAN::P24530
Residue:442
BDBM50141472
NameBDBM50141472
Synonyms:(5S,6R,7R)-5-Benzo[1,3]dioxol-5-yl-2-isopropylamino-7-[4-methoxy-2-(3-methoxy-2-methyl-propyl)-phenyl]-6,7-dihydro-5H-[1]pyrindine-6-carboxylic acid | CHEMBL289634
TypeSmall organic molecule
Emp. Form.C31H36N2O6
Mol. Mass.532.6273
SMILESCOCC(C)Cc1cc(OC)ccc1[C@H]1[C@@H]([C@H](c2ccc(NC(C)C)nc12)c1ccc2OCOc2c1)C(O)=O