Reaction Details
TargetEndothelin-1 receptor
LigandBDBM50141461
Substrate/Competitorn/a
Meas. Tech.ChEMBL_65489 (CHEMBL682364)
IC50 0.048±n/a nM
Citation Takahashi, HOhtake, NSakamoto, TIino, TKawanishi, NNakamura, MYoshizumi, TNiiyama, KOzaki, SOkada, HKano, ATakahashi, HIshii, YOkada, MSaito, MSawazaki, YHayama, TNishikibe, M Structure-activity relationships of a novel class of endothelin receptor selective antagonists; 6-carboxy-2-isopropylamino-5,7-diarylcyclopenteno[1,2-b]pyridines. Bioorg Med Chem Lett14:1503-7 (2004) 
 
Endothelin-1 receptor
Name:Endothelin-1 receptor
Type:Enzyme Catalytic Domain
Mol. Mass.:48736.88
Organism:Homo sapiens (Human)
Description:P25101
Residue:427
BDBM50141461
NameBDBM50141461
Synonyms:(5S,6R,7R)-5-Benzo[1,3]dioxol-5-yl-7-[2-(2,3-dihydroxy-propyl)-4-methoxy-phenyl]-2-isopropylamino-6,7-dihydro-5H-[1]pyrindine-6-carboxylic acid | CHEMBL286621
TypeSmall organic molecule
Emp. Form.C29H32N2O7
Mol. Mass.520.5736
SMILESCOc1ccc([C@H]2[C@@H]([C@H](c3ccc(NC(C)C)nc23)c2ccc3OCOc3c2)C(O)=O)c(CC(O)CO)c1