Reaction Details
TargetTumor necrosis factor receptor superfamily member 1A
LigandBDBM50141529
Substrate/Competitorn/a
Meas. Tech.ChEBML_224214
IC50 1000±n/a nM
Citation Meng, CQZheng, XSNi, LYe, ZSimpson, JEWorsencroft, KJHotema, MRWeingarten, MDSkudlarek, JWGilmore, JMHoong, LKHill, RRMarino, EMSuen, KLKunsch, CWasserman, MASikorski, JA Discovery of novel heteroaryl-substituted chalcones as inhibitors of TNF-alpha-induced VCAM-1 expression. Bioorg Med Chem Lett14:1513-7 (2004) 
 
Tumor necrosis factor receptor superfamily member 1A
Name:Tumor necrosis factor receptor superfamily member 1A
Type:PROTEIN
Mol. Mass.:50495.39
Organism:Homo sapiens (Human)
Description:ChEMBL_1509419
Residue:455
BDBM50141529
NameBDBM50141529
Synonyms:(E)-1-[3,5-Dimethoxy-4-(4-methoxy-benzyloxy)-phenyl]-3-(3,4,5-trimethoxy-phenyl)-propenone | CHEMBL290167
TypeSmall organic molecule
Emp. Form.C28H30O8
Mol. Mass.494.533
SMILESCOc1ccc(COc2c(OC)cc(cc2OC)C(=O)\C=C\c2cc(OC)c(OC)c(OC)c2)cc1