Reaction Details
TargetTumor necrosis factor receptor superfamily member 1A
LigandBDBM50141544
Substrate/Competitorn/a
Meas. Tech.ChEBML_224214
IC50 2000±n/a nM
Citation Meng, CQZheng, XSNi, LYe, ZSimpson, JEWorsencroft, KJHotema, MRWeingarten, MDSkudlarek, JWGilmore, JMHoong, LKHill, RRMarino, EMSuen, KLKunsch, CWasserman, MASikorski, JA Discovery of novel heteroaryl-substituted chalcones as inhibitors of TNF-alpha-induced VCAM-1 expression. Bioorg Med Chem Lett14:1513-7 (2004) 
 
Tumor necrosis factor receptor superfamily member 1A
Name:Tumor necrosis factor receptor superfamily member 1A
Type:PROTEIN
Mol. Mass.:50495.39
Organism:Homo sapiens (Human)
Description:ChEMBL_1509419
Residue:455
BDBM50141544
NameBDBM50141544
Synonyms:(E)-3-[2-Methoxy-5-(4-methyl-thiophen-2-yl)-phenyl]-1-(3,4,5-trimethoxy-phenyl)-propenone | CHEMBL290392
TypeSmall organic molecule
Emp. Form.C24H24O5S
Mol. Mass.424.509
SMILESCOc1ccc(cc1\C=C\C(=O)c1cc(OC)c(OC)c(OC)c1)-c1cc(C)cs1