Reaction Details
TargetTumor necrosis factor receptor superfamily member 1A
LigandBDBM50141549
Substrate/Competitorn/a
Meas. Tech.ChEBML_224214
IC50 2000±n/a nM
Citation Meng, CQZheng, XSNi, LYe, ZSimpson, JEWorsencroft, KJHotema, MRWeingarten, MDSkudlarek, JWGilmore, JMHoong, LKHill, RRMarino, EMSuen, KLKunsch, CWasserman, MASikorski, JA Discovery of novel heteroaryl-substituted chalcones as inhibitors of TNF-alpha-induced VCAM-1 expression. Bioorg Med Chem Lett14:1513-7 (2004) 
 
Tumor necrosis factor receptor superfamily member 1A
Name:Tumor necrosis factor receptor superfamily member 1A
Type:PROTEIN
Mol. Mass.:50495.39
Organism:Homo sapiens (Human)
Description:ChEMBL_1509419
Residue:455
BDBM50141549
NameBDBM50141549
Synonyms:(E)-3-(5-Bromo-2,4-dimethoxy-phenyl)-1-(3,4,5-trimethoxy-phenyl)-propenone | CHEMBL37200
TypeSmall organic molecule
Emp. Form.C20H21BrO6
Mol. Mass.437.281
SMILESCOc1cc(OC)c(\C=C\C(=O)c2cc(OC)c(OC)c(OC)c2)cc1Br