Reaction Details
TargetDual specificity calcium/calmodulin-dependent 3',5'-cyclic nucleotide phosphodiesterase 1A/1B
LigandBDBM50141581
Substrate/Competitorn/a
Meas. Tech.ChEMBL_156175 (CHEMBL760944)
IC50>50000±n/a nM
Citation Bi, YStoy, PAdam, LHe, BKrupinski, JNormandin, DPongrac, RSeliger, LWatson, AMacor, JE Quinolines as extremely potent and selective PDE5 inhibitors as potential agents for treatment of erectile dysfunction. Bioorg Med Chem Lett14:1577-80 (2004) 
 
Dual specificity calcium/calmodulin-dependent 3',5'-cyclic nucleotide phosphodiesterase 1A/1B
Name:Dual specificity calcium/calmodulin-dependent 3',5'-cyclic nucleotide phosphodiesterase 1A/1B
Synonyms:Phosphodiesterase 1
Type:n/a
Mol. Mass.:n/a
Description:ASSAY_ID of ChEMBL is 156011
Components:This complex has 2 components.
Component 1
Name:Dual specificity calcium/calmodulin-dependent 3',5'-cyclic nucleotide phosphodiesterase 1B
Type:PROTEIN
Mol. Mass.:60991.90
Organism:Bos taurus
Description:ChEMBL_104913
Residue:534
Component 2
Name:Dual specificity calcium/calmodulin-dependent 3',5'-cyclic nucleotide phosphodiesterase 1A
Synonyms:Calcium/calmodulin-dependent 3',5'-cyclic nucleotide phosphodiesterase 1A PDE1A Phosphodiesterase 1 | Phosphodiesterase 1A
Type:Enzyme Catalytic Domain
Mol. Mass.:60835.05
Organism:BOVINE
Description:Phosphodiesterase 1 0 BOVINE::P14100
Residue:530
BDBM50141581
NameBDBM50141581
Synonyms:4-(3-Chloro-4-methoxy-benzylamino)-7-trifluoromethyl-quinoline-3-carboxylic acid ethyl ester | CHEMBL41950
TypeSmall organic molecule
Emp. Form.C21H18ClF3N2O3
Mol. Mass.438.827
SMILESCCOC(=O)c1cnc2cc(ccc2c1NCc1ccc(OC)c(Cl)c1)C(F)(F)F