Reaction Details
TargetRetinoic acid receptor RXR-alpha
LigandBDBM50141600
Substrate/Competitorn/a
Meas. Tech.ChEMBL_196920 (CHEMBL807382)
Ki 101±n/a nM
Citation Michellys, PYD'Arrigo, JGrese, TAKaranewsky, DSLeibowitz, MDMais, DAMapes, CMReifel-Miller, ARungta, DBoehm, MF Design, synthesis and structure-activity relationship of novel RXR-selective modulators. Bioorg Med Chem Lett14:1593-8 (2004) 
 
Retinoic acid receptor RXR-alpha
Name:Retinoic acid receptor RXR-alpha
Type:PROTEIN
Mol. Mass.:50820.38
Organism:Homo sapiens (Human)
Description:ChEMBL_1456363
Residue:462
BDBM50141600
NameBDBM50141600
Synonyms:(Z)-3-{7-[2-(2,2-Difluoro-ethoxy)-3,5-diisopropyl-phenyl]-benzofuran-2-yl}-2-fluoro-but-2-enoic acid | CHEMBL41422
TypeSmall organic molecule
Emp. Form.C26H27F3O4
Mol. Mass.460.4854
SMILESCC(C)c1cc(C(C)C)c(OCC(F)F)c(c1)-c1cccc2cc(oc12)C(\C)=C(/F)C(O)=O