Reaction Details
TargetRetinoic acid receptor RXR-alpha
LigandBDBM50141593
Substrate/Competitorn/a
Meas. Tech.ChEMBL_196594 (CHEMBL800472)
EC50 390±n/a nM
Citation Michellys, PYD'Arrigo, JGrese, TAKaranewsky, DSLeibowitz, MDMais, DAMapes, CMReifel-Miller, ARungta, DBoehm, MF Design, synthesis and structure-activity relationship of novel RXR-selective modulators. Bioorg Med Chem Lett14:1593-8 (2004) 
 
Retinoic acid receptor RXR-alpha
Name:Retinoic acid receptor RXR-alpha
Type:PROTEIN
Mol. Mass.:50820.38
Organism:Homo sapiens (Human)
Description:ChEMBL_1456363
Residue:462
BDBM50141593
NameBDBM50141593
Synonyms:(E)-3-[7-(2-Ethoxy-3,5-diisopropyl-phenyl)-benzo[b]thiophen-2-yl]-but-2-enoic acid | CHEMBL417520
TypeSmall organic molecule
Emp. Form.C26H30O3S
Mol. Mass.422.58
SMILESCCOc1c(cc(cc1-c1cccc2cc(sc12)C(\C)=C\C(O)=O)C(C)C)C(C)C