Reaction Details
TargetRetinoic acid receptor RXR-alpha
LigandBDBM50452047
Substrate/Competitorn/a
Meas. Tech.ChEMBL_196599 (CHEMBL799677)
IC50 20±n/a nM
Citation Michellys, PYD'Arrigo, JGrese, TAKaranewsky, DSLeibowitz, MDMais, DAMapes, CMReifel-Miller, ARungta, DBoehm, MF Design, synthesis and structure-activity relationship of novel RXR-selective modulators. Bioorg Med Chem Lett14:1593-8 (2004) 
 
Retinoic acid receptor RXR-alpha
Name:Retinoic acid receptor RXR-alpha
Type:PROTEIN
Mol. Mass.:50820.38
Organism:Homo sapiens (Human)
Description:ChEMBL_1456363
Residue:462
BDBM50452047
NameBDBM50452047
Synonyms:CHEMBL2372524
TypeSmall organic molecule
Emp. Form.C14H21N4O6P
Mol. Mass.372.3135
SMILESC[C@H](NC(=O)[C@H](Cc1ccccc1)NP(O)(O)=O)C(=O)NCC(N)=O