Reaction Details
TargetRetinoic acid receptor RXR-beta
LigandBDBM50141594
Substrate/Competitorn/a
Meas. Tech.ChEBML_196588
Ki 2700±n/a nM
Citation Michellys, PYD'Arrigo, JGrese, TAKaranewsky, DSLeibowitz, MDMais, DAMapes, CMReifel-Miller, ARungta, DBoehm, MF Design, synthesis and structure-activity relationship of novel RXR-selective modulators. Bioorg Med Chem Lett14:1593-8 (2004) 
 
Retinoic acid receptor RXR-beta
Name:Retinoic acid receptor RXR-beta
Type:PROTEIN
Mol. Mass.:55877.78
Organism:Mus musculus
Description:ChEMBL_196588
Residue:520
BDBM50141594
NameBDBM50141594
Synonyms:(E)-3-{7-[3,5-Diisopropyl-2-(2,2,2-trifluoro-ethoxy)-phenyl]-benzofuran-2-yl}-but-2-enoic acid | CHEMBL39206
TypeSmall organic molecule
Emp. Form.C26H27F3O4
Mol. Mass.460.4854
SMILESCC(C)c1cc(C(C)C)c(OCC(F)(F)F)c(c1)-c1cccc2cc(oc12)C(\C)=C\C(O)=O