Reaction Details
TargetRetinoic acid receptor RXR-gamma
LigandBDBM50129720
Substrate/Competitorn/a
Meas. Tech.ChEBML_196589
Ki>1000±n/a nM
Citation Michellys, PYD'Arrigo, JGrese, TAKaranewsky, DSLeibowitz, MDMais, DAMapes, CMReifel-Miller, ARungta, DBoehm, MF Design, synthesis and structure-activity relationship of novel RXR-selective modulators. Bioorg Med Chem Lett14:1593-8 (2004) 
 
Retinoic acid receptor RXR-gamma
Name:Retinoic acid receptor RXR-gamma
Type:PROTEIN
Mol. Mass.:50900.28
Organism:Mus musculus
Description:ChEMBL_196589
Residue:463
BDBM50129720
NameBDBM50129720
Synonyms:(2E,4E,6Z)-7-[3,5-Di-tert-butyl-2-(2,2-difluoro-ethoxy)-phenyl]-3-methyl-octa-2,4,6-trienoic acid CHEMBL42314
TypeSmall organic molecule
Emp. Form.C25H34F2O3
Mol. Mass.420.5325
SMILESC\C(\C=C\C=C(\C)c1cc(cc(c1OCC(F)F)C(C)(C)C)C(C)(C)C)=C/C(O)=O