Reaction Details
TargetRetinoic acid receptor RXR-beta
LigandBDBM50141604
Substrate/Competitorn/a
Meas. Tech.ChEBML_196588
Ki>10000±n/a nM
Citation Michellys, PYD'Arrigo, JGrese, TAKaranewsky, DSLeibowitz, MDMais, DAMapes, CMReifel-Miller, ARungta, DBoehm, MF Design, synthesis and structure-activity relationship of novel RXR-selective modulators. Bioorg Med Chem Lett14:1593-8 (2004) 
 
Retinoic acid receptor RXR-beta
Name:Retinoic acid receptor RXR-beta
Type:PROTEIN
Mol. Mass.:55877.78
Organism:Mus musculus
Description:ChEMBL_196588
Residue:520
BDBM50141604
NameBDBM50141604
Synonyms:(E)-3-[4-(3,5-Diisopropyl-2-propoxy-phenyl)-benzo[b]thiophen-2-yl]-but-2-enoic acid | CHEMBL41742
TypeSmall organic molecule
Emp. Form.C27H32O3S
Mol. Mass.436.606
SMILESCCCOc1c(cc(cc1-c1cccc2sc(cc12)C(\C)=C\C(O)=O)C(C)C)C(C)C