Reaction Details
TargetRetinoic acid receptor RXR-gamma
LigandBDBM50141601
Substrate/Competitorn/a
Meas. Tech.ChEBML_196589
Ki>10000±n/a nM
Citation Michellys, PYD'Arrigo, JGrese, TAKaranewsky, DSLeibowitz, MDMais, DAMapes, CMReifel-Miller, ARungta, DBoehm, MF Design, synthesis and structure-activity relationship of novel RXR-selective modulators. Bioorg Med Chem Lett14:1593-8 (2004) 
 
Retinoic acid receptor RXR-gamma
Name:Retinoic acid receptor RXR-gamma
Type:PROTEIN
Mol. Mass.:50900.28
Organism:Mus musculus
Description:ChEMBL_196589
Residue:463
BDBM50141601
NameBDBM50141601
Synonyms:(E)-3-[7-(2-Ethoxy-3,5-diisopropyl-phenyl)-benzofuran-2-yl]-but-2-enoic acid | CHEMBL289057
TypeSmall organic molecule
Emp. Form.C26H30O4
Mol. Mass.406.514
SMILESCCOc1c(cc(cc1-c1cccc2cc(oc12)C(\C)=C\C(O)=O)C(C)C)C(C)C