Reaction Details
TargetRetinoic acid receptor RXR-beta
LigandBDBM50141591
Substrate/Competitorn/a
Meas. Tech.ChEBML_197088
Ki 12±n/a nM
Citation Michellys, PYD'Arrigo, JGrese, TAKaranewsky, DSLeibowitz, MDMais, DAMapes, CMReifel-Miller, ARungta, DBoehm, MF Design, synthesis and structure-activity relationship of novel RXR-selective modulators. Bioorg Med Chem Lett14:1593-8 (2004) 
 
Retinoic acid receptor RXR-beta
Name:Retinoic acid receptor RXR-beta
Type:PROTEIN
Mol. Mass.:56932.89
Organism:Homo sapiens (Human)
Description:ChEMBL_39045
Residue:533
BDBM50141591
NameBDBM50141591
Synonyms:(E)-3-[4-(3,5-Di-tert-butyl-2-heptyloxy-phenyl)-benzo[b]thiophen-2-yl]-but-2-enoic acid | CHEMBL291034
TypeSmall organic molecule
Emp. Form.C33H44O3S
Mol. Mass.520.766
SMILESCCCCCCCOc1c(cc(cc1C(C)(C)C)C(C)(C)C)-c1cccc2sc(cc12)C(\C)=C\C(O)=O