Reaction Details
TargetRetinoic acid receptor RXR-beta
LigandBDBM50141603
Substrate/Competitorn/a
Meas. Tech.ChEBML_196588
Ki>10000±n/a nM
Citation Michellys, PYD'Arrigo, JGrese, TAKaranewsky, DSLeibowitz, MDMais, DAMapes, CMReifel-Miller, ARungta, DBoehm, MF Design, synthesis and structure-activity relationship of novel RXR-selective modulators. Bioorg Med Chem Lett14:1593-8 (2004) 
 
Retinoic acid receptor RXR-beta
Name:Retinoic acid receptor RXR-beta
Type:PROTEIN
Mol. Mass.:55877.78
Organism:Mus musculus
Description:ChEMBL_196588
Residue:520
BDBM50141603
NameBDBM50141603
Synonyms:(E)-3-{7-[2-(2,2-Difluoro-ethoxy)-3,5-diisopropyl-phenyl]-benzofuran-2-yl}-but-2-enoic acid | CHEMBL265051
TypeSmall organic molecule
Emp. Form.C26H28F2O4
Mol. Mass.442.4949
SMILESCC(C)c1cc(C(C)C)c(OCC(F)F)c(c1)-c1cccc2cc(oc12)C(\C)=C\C(O)=O