Reaction Details
TargetRetinoic acid receptor alpha
LigandBDBM50141597
Substrate/Competitorn/a
Meas. Tech.ChEBML_196468
Ki>10000±n/a nM
Citation Michellys, PYD'Arrigo, JGrese, TAKaranewsky, DSLeibowitz, MDMais, DAMapes, CMReifel-Miller, ARungta, DBoehm, MF Design, synthesis and structure-activity relationship of novel RXR-selective modulators. Bioorg Med Chem Lett14:1593-8 (2004) 
 
Retinoic acid receptor alpha
Name:Retinoic acid receptor alpha
Type:PROTEIN
Mol. Mass.:50778.87
Organism:Homo sapiens (Human)
Description:ChEMBL_1466191
Residue:462
BDBM50141597
NameBDBM50141597
Synonyms:(E)-3-{4-[3,5-Di-tert-butyl-2-(3,3-difluoro-propoxy)-phenyl]-benzo[b]thiophen-2-yl}-but-2-enoic acid | CHEMBL43238
TypeSmall organic molecule
Emp. Form.C29H34F2O3S
Mol. Mass.500.64
SMILESC\C(=C/C(O)=O)c1cc2c(cccc2s1)-c1cc(cc(c1OCCC(F)F)C(C)(C)C)C(C)(C)C