Reaction Details
TargetC-C chemokine receptor type 5
LigandBDBM50119336
Substrate/Competitorn/a
Meas. Tech.ChEMBL_44682 (CHEMBL656554)
IC50 0.200000±n/a nM
Citation Shen, DMShu, MMills, SGChapman, KTMalkowitz, LSpringer, MSGould, SLDeMartino, JASiciliano, SJKwei, GYCarella, ACarver, GHolmes, KSchleif, WADanzeisen, RHazuda, DKessler, JLineberger, JMiller, MDEmini, EA Antagonists of human CCR5 receptor containing 4-(pyrazolyl)piperidine side chains. Part 1: Discovery and SAR study of 4-pyrazolylpiperidine side chains. Bioorg Med Chem Lett14:935-9 (2004) 
 
C-C chemokine receptor type 5
Name:C-C chemokine receptor type 5
Type:Enzyme
Mol. Mass.:40540.21
Organism:Homo sapiens (Human)
Description:P51681
Residue:352
BDBM50119336
NameBDBM50119336
Synonyms:2-cyclohexyl-2-{3-phenyl-4-[4-(3-phenylpropyl)hexahydro-1-pyridinylmethyl]tetrahydro-1H-1-pyrrolyl}acetic acid Cyclohexyl-{3-phenyl-4-[4-(3-phenyl-propyl)-piperidin-1-ylmethyl]-pyrrolidin-1-yl}-acetic acid
TypeSmall organic molecule
Emp. Form.C33H46N2O2
Mol. Mass.502.7305
SMILESOC(=O)[C@@H](C1CCCCC1)N1C[C@H](CN2CCC(CCCc3ccccc3)CC2)[C@H](C1)c1ccccc1