Reaction Details
TargetRNA-directed RNA polymerase
LigandBDBM50142041
Substrate/Competitorn/a
Meas. Tech.ChEBML_143775
IC50 20±n/a nM
Citation Beaulieu, PLBös, MBousquet, YDeRoy, PFazal, GGauthier, JGillard, JGoulet, SMcKercher, GPoupart, MAValois, SKukolj, G Non-nucleoside inhibitors of the hepatitis C virus NS5B polymerase: discovery of benzimidazole 5-carboxylic amide derivatives with low-nanomolar potency. Bioorg Med Chem Lett14:967-71 (2004) 
 
RNA-directed RNA polymerase
Name:RNA-directed RNA polymerase
Type:Protein
Mol. Mass.:25173.95
Organism:Hepatitis C virus
Description:Q8JXU8
Residue:229
BDBM50142041
NameBDBM50142041
Synonyms:3-{(S)-2-Carboxy-2-[(1-cyclohexyl-2-furan-3-yl-1H-benzoimidazole-5-carbonyl)-amino]-ethyl}-1H-indole-5-carboxylic acid | CHEMBL176905
TypeSmall organic molecule
Emp. Form.C30H28N4O6
Mol. Mass.540.5665
SMILESOC(=O)[C@H](Cc1c[nH]c2ccc(cc12)C(O)=O)NC(=O)c1ccc2n(C3CCCCC3)c(nc2c1)-c1ccoc1