Reaction Details
TargetRNA-directed RNA polymerase
LigandBDBM50142042
Substrate/Competitorn/a
Meas. Tech.ChEBML_143775
IC50 8±n/a nM
Citation Beaulieu, PLBös, MBousquet, YDeRoy, PFazal, GGauthier, JGillard, JGoulet, SMcKercher, GPoupart, MAValois, SKukolj, G Non-nucleoside inhibitors of the hepatitis C virus NS5B polymerase: discovery of benzimidazole 5-carboxylic amide derivatives with low-nanomolar potency. Bioorg Med Chem Lett14:967-71 (2004) 
 
RNA-directed RNA polymerase
Name:RNA-directed RNA polymerase
Type:Protein
Mol. Mass.:25173.95
Organism:Hepatitis C virus
Description:Q8JXU8
Residue:229
BDBM50142042
NameBDBM50142042
Synonyms:(S)-2-[(1-Cyclohexyl-2-furan-3-yl-1H-benzoimidazole-5-carbonyl)-amino]-3-[5-(oxalyl-amino)-1H-indol-3-yl]-propionic acid | CHEMBL173466
TypeSmall organic molecule
Emp. Form.C31H29N5O7
Mol. Mass.583.5913
SMILESOC(=O)[C@H](Cc1c[nH]c2ccc(NC(=O)C(O)=O)cc12)NC(=O)c1ccc2n(C3CCCCC3)c(nc2c1)-c1ccoc1