Reaction Details
TargetRNA-directed RNA polymerase
LigandBDBM50142049
Substrate/Competitorn/a
Meas. Tech.ChEBML_143775
IC50 120±n/a nM
Citation Beaulieu, PLBös, MBousquet, YDeRoy, PFazal, GGauthier, JGillard, JGoulet, SMcKercher, GPoupart, MAValois, SKukolj, G Non-nucleoside inhibitors of the hepatitis C virus NS5B polymerase: discovery of benzimidazole 5-carboxylic amide derivatives with low-nanomolar potency. Bioorg Med Chem Lett14:967-71 (2004) 
 
RNA-directed RNA polymerase
Name:RNA-directed RNA polymerase
Type:Protein
Mol. Mass.:25173.95
Organism:Hepatitis C virus
Description:Q8JXU8
Residue:229
BDBM50142049
NameBDBM50142049
Synonyms:(S)-2-[(1-Cyclohexyl-2-furan-3-yl-1H-benzoimidazole-5-carbonyl)-amino]-3-(5-methanesulfonylamino-1H-indol-3-yl)-propionic acid | CHEMBL177073
TypeSmall organic molecule
Emp. Form.C30H31N5O6S
Mol. Mass.589.662
SMILESCS(=O)(=O)Nc1ccc2[nH]cc(C[C@H](NC(=O)c3ccc4n(C5CCCCC5)c(nc4c3)-c3ccoc3)C(O)=O)c2c1